Архив метки: vue.js

babel — Module build failed (from ./node_modules/babel-loader/lib/index.js) with webpack

При попытке настроить babel c использованием webpack — получил следующую ошибку

ERROR in ./src/index.js Module build failed (from ./node_modules/babel-loader/lib/index.js): Error: Cannot find module '@babel/core' ERROR in ./src/index.js Module build failed (from ./node_modules/babel-loader/lib/index.js): Error: Cannot find module '@babel/core' npm ERR! code ELIFECYCLE npm ERR! errno 2 npm ERR! webpack-4-tutorial@1.0.0 build: `webpack --mode production` npm ERR! Exit status 2 npm ERR! npm ERR! Failed at the webpack-4-tutorial@1.0.0 build script. npm ERR! This is probably not a problem with npm. There is likely additional logging output above. npm ERR! A complete log of this run can be found in: npm ERR! C:\Users\<user>\AppData\Roaming\npm-cache\_logs\2021-06-09T08_00_00_123Z-debug.log
Code language: JavaScript (javascript)
Читать далее

Vue.js — Expected Boolean, got String with value «true»

При попытке установить значение переменной boolean типа возникает следующая ошибка:

Invalid prop: type check failed for prop «xxx». Expected Boolean, got String with value «true».

Читать далее